Latest Tutorials| Questions and Answers|Ask Questions?|Site Map



Home Answers Viewqa Hibernate Webshpere compilation error

Have Programming Question? Ask it here!
 
 
 


thriyampagan
Webshpere compilation error
0 Answer(s)      3 years and 10 months ago
Posted in : Hibernate



I want clear result . Thank you

WSWS3166E: Error: No client transport named 'http' found.
faultActor: null
faultDetail:

[10/5/10 13:19:40:937 EDT] 00000043 SystemOut O WSWS3166E: Error: No client transport named 'http' found.

Advertisement
View Answers

Related Tutorials/Questions & Answers:
Webshpere compilation error
Webshpere compilation error   I want clear result . Thank you WSWS3166E: Error: No client transport named 'http' found. faultActor: null faultDetail: [10/5/10 13:19:40:937 EDT] 00000043 SystemOut O WSWS3166E: Error
compilation error
compilation error  Hi my program below is not compiling,when I try to compile it i'm getting the error message "tool completed with exit code 1".The loop has to be at the end of the program can you help me. Blockquoteimport
Advertisements
java compilation error - Applet
java compilation error  I am getting compilation error in the following code.: public void paint(Graphics g) { switch(screen...; } } Error is: Illegal start of expression Plz. find why am I getting this error
groovy compilation error - Framework
] [groovyc] 1 error Compilation error: Compilation Failed how we can resolve...groovy compilation error  while i am running the grails application , i got the error message like: [groovyc
jdbc compilation error - JDBC
jdbc compilation error  java.lang.Exception: Problem in call_select when i am executing the program i am getting the above error. how can i resolve it?  Hi friend, plz specify in detail and send me code
java compilation error - Applet
java compilation error  hi friends the following is the awt front design program error, give me the replay E:\ramesh>javac product.java Note: product.java uses or overrides a deprecated API. Note
Java compilation error - Java Beginners
Java compilation error  Method overridden problems in compile time error
java compilation error - Hibernate
java compilation error  hi i am getting org.hibernate.exception.GenericJDBCException: Cannot open connection exception when runnig the code why this exception is coming
compilation error - Java Beginners
compilation error  class s { public static void main(String ar[]) { int j=0834... this program it is giving an error as integer number is too large.why? and what
compilation error - Java Beginners
compilation error   import java.awt.*; import java.awt.event.*; import javax.swing.*; class BLayout implements ActionListener { JFrame f ; JPanel jp; JButton b[]; CardLayout cl; BLayout(String s) { jp = new JPanel
compilation error - Java Beginners
compilation error  i 'm not able to compile a program : prblem is there is one package in which 2 class person & dog reside. both classes r public... in same package Dog class is being compiled bt. Person is not compiled . error
Compilation Error - Struts
Compilation Error  description The server encountered an internal error () that prevented it from fulfilling this request. exception org.apache.jasper.JasperException: Failed to load or instantiate TagExtraInfo class
compilation error - Java Beginners
compilation error  sir what is the error inthis code after executing the below code i got java.lang.NoSuchMethodError: main Exception in thread "main" package org.array; import java.io.*; public class Employee
Java Compilation error - SQL
Java Compilation error  ava.lang.NullPointerException at beanUtils.SaleHeaderUtility.getFullRemainPatientList(SaleHeaderUtility.java:754) at forms.ProcessDialog.updatePatientBalances(ProcessDialog.java:119
java compilation error - Hibernate
java compilation error  hi, i have made an registration page whosevalues should be inserted into database. i have used hibernate and eclipse it is working fine. but when i make a war file and deploy it using ant and then run
java compilation error - Ant
java compilation error  hi, i have a application in which i m reading from an xml file and then storing its values in database.but when i started using ant its main program is not running as it is unable to detect the jar file
compilation error - Java Beginners
compilation error  Dear sir, When i compile some pgms i am getting below error.what may be the reason? "uses or overrides a deprecated API. Note: Recompile with -Xlint:deprecation for details."  Hi Friend
java compilation error - JDBC
java compilation error   /* *Project:employee.java *Date:April 04,2007. *Purpose:To All Java Developers **/ package employee; import javax.swing.*; import java.awt.*; import javax.swing.border.
compilation error - JSP-Servlet
compilation error  Hi sir, i'm using following code to upload an image to the database.I'm facing the following problem. <% String contentType = request.getContentType(); if ((contentType != null
java compilation error - Java Beginners
java compilation error  HELLO SIR,I HAVE ASKED QUESTION AND I GOT REPLY FOR THAT ALSO BUT I AM GETING COMPILATION ERROR UNCHECKED OR UNSAFE OPERATION PLZ RECTIFY THIS. HOW TO READ ELEMENTS FROM TWO ARRAYLIST AND PRINT
java compilation error - Java Beginners
java compilation error  Sir Thanx for ur response for reading a doc file but when i tried to execute ur code compilation error occurs, it says --> org.apache.poi.hwpf package does not exist. -->
Java Compilation error - Java Beginners
Java Compilation error  I got this error while convert java to pdf... Exception:java.lang.IndexOutOfBoundsException: reserve - incorrect column/size can somebody told me how to handle this error...  Hi Friend
Compilation error. Hibernate code - Hibernate
Compilation error. Hibernate code   Exception in thread "main" java.lang.NoClassDefFoundError: org/slf4j/LoggerFactory...) how to rectify that error in hibernate  Hi Friend, You have
Java Compilation error - Java Beginners
Java Compilation error   i wrote a simple hello world program i get this error every time please help Exception in thread "main" java.lang.NullPointerException
java compilation error - Java Beginners
java compilation error  i have downloaded java software(version 6 update 12) from www.java.com. whenever i try to compile the program using javac command, error message is displayed javac is not recognized as an internal
java compilation error - Java Beginners
java compilation error  I need to know how to correct a compiler error for my program to run. The error I keep getting is unclosed string literal... and this is when my compiler error occurs. Let me know if you need any
java compilation error - Java Beginners
java compilation error  i am going to type program and the error is shaded one this one is giving error please sole this one sir import java.io....:"+ch); } }   Hi friend, Having some error in your code check
java compilation error - Java Beginners
java compilation error  Hello, I'm having problems with trying.... It's flagging two errors for this one code. The first error says identifier expected and the next error says invalid method declaration; return type required
java compilation error - Java Beginners
java compilation error  i am going to type program and the error is shaded one this one is giving error please sole this one sir import java.io....:"+ch); } }   Hi friend, Having some error in your code check
java compilation error - Java Beginners
java compilation error  Dear Sir ........ I was installed the java soft ware in PC by following your guidelines only, after installing I'm... getting the error like file not found : exxx.java(my file name is exx), Ill
Java compilation error - Java Beginners
Java compilation error  Hello I am having this problem while compiling I create a file the package is com.deitel.ch14; the filename...\AccountRecord.java I save AccountRecord.java in ch14 However I get an error saying
Compilation error in java - Java Beginners
Compilation error in java  i have a properties file named "connecton.properties" which has details about database server connection. when i load i... FileInputStream(f); props.load(in); but i got a error the system could
java compilation error - Swing AWT
java compilation error   NestedPopupMenu n = new NestedPopupMenu(); getting error as "local variable n is never read  Hi dharani, This is running code. I hope that this code will help you. import java.util.
compilation error in java - Java Beginners
compilation error in java  Here is the pgm usinf if-else statement.... For removing the error you have to use the String type in place of char & your code will work without any error
Java compilation error - Java Beginners
Java compilation error  Hello, i am getting an error while running simple core java program on command prompt.java is installed on my pc. the error is: javac:file not found usage:javac Regards, jyoti prakash 
java compilation error - Java Beginners
java compilation error   1)java code: import java.awt.*; import javax.swing.*; public class ButtonsPanelApplet extends JApplet{ public void... ButtonPanelApplet does give me error of "exception in thread main...."  
Java Compilation Error - Java Beginners
Java Compilation Error   Actually Iam having a packaging. Whatever methods and the imported packages are used in the program are available... imported packages. What ever error iam getting is at the array usage. So, guide me
Java compilation error - JSP-Servlet
Java compilation error  Hi, im trying to do a report creation using... to my problem, but having some error as below.. Generated servlet error: C...; ^ Generated servlet error: C:\Program Files\Apache Software Foundation
java compilation error - Java Beginners
java compilation error  Hello, I had recently sent an email...); MY ERROR FLAGS HERE public class DisplayImage extends Panel { BufferedImage image; public DisplayImage() { try{ MY SECOND ERROR FLAGS HERE
Java Compilation and running error - RMI
Java Compilation and running error   The following set of programs... some problem and gives following on compilation"java uses unchecked or unsafe...); } catch(Exception e) { System.out.println("Error: " + e
Java Compilation error - Java Beginners
Java Compilation error  import java.io.*; import java.util.... error there,.. [';' expected] the semicolon i already put at the end like above,..but still the same error.. can u help me solve this problm?please
Java Compilation error - Java Beginners
Java Compilation error  import java.io.*; import java.util....? } } when i write [owner = check.resulAcc()throws IOException;] get error... the same error.. can u help me solve this problm?please
java compilation error - Java Beginners
java compilation error  Hello madam/sir, i m a beginners in java. My problem is that i want to connect a login form to a frame containing 4 panels. how could i do it?Please help
java compilation error - Java Beginners
java compilation error  Hello, I sent a previous message regarding... can't run it ProductInventoryVGUI Uncaught error fetching image... thats maybe why I'm getting that error message. Is there a way I can find an image
: Java Compilation error. - Java Beginners
: Java Compilation error.  what is the difference between static block and static method?  Hi friend, Static block will execute when ever execution starts, it means this block executes first of all, where
Java compilation error - Java Beginners
Java compilation error  hai, now only i have started to work with java.I have been given a task as execute unix codes using eclipse.But i dont know the source codes.Please help me to start the program... Regards, R.Punitham
java compilation error - Java Beginners
java compilation error  can not find symbol sysbol:method println(int,int,int) location: class java.io.PrintStream) System.out.println(+a,+b,+c);  Hi friend, Please, specify in detail what's your problem
java compilation error - JSP-Servlet
java compilation error  How to compile a java Program,If i am having jdk1.5 in webligic it support jdk1.4..When i put a .class file into WEB-INF/classes/Mybeans/Datacon.class it was given a error  Hi friend
Java Compilation error - Java Beginners
Java Compilation error  What's wrong with this: public enum RockPaperScissors { ROCK ("Rock crushes scissors."), PAPER ("Paper covers...; } } /*error starts here-->*/public static boolean validSelection(char
java compilation error - Java Beginners
java compilation error  package punitha; import java.util.Vector; import javax.swing.*; import javax.swing.JFrame.*; import... calling other java pgms like k-means and Readfile... when i execute am getting error
 

 

 

DMCA.com