Programming Tutorials Browser Tutorials Articles Struts Tutorials Hibernate Tutorials

Search: 

  Tutorial: Compilation Error in Java Bean - Java Beginners

Compilation Error in Java Bean - Java Beginners


Tutorial Details:
Compilation Error in Java Bean - Java Beginners

Read Tutorial Compilation Error in Java Bean - Java Beginners.

Rate Tutorial:
Compilation Error in Java Bean - Java Beginners

View Tutorial:
Compilation Error in Java Bean - Java Beginners

Related Tutorials:

Displaying 1 - 50 of about 2735 Related Tutorials.

compilation error
compilation error  Hi my program below is not compiling,when I try to compile it i'm getting the error message "tool completed with exit code 1".The loop has to be at the end of the program can you help me. Blockquoteimport
 
groovy compilation error - Framework
] [groovyc] 1 error Compilation error: Compilation Failed how we can resolve...groovy compilation error  while i am running the grails application , i got the error message like: [groovyc
 
Webshpere compilation error
Webshpere compilation error   I want clear result . Thank you WSWS3166E: Error: No client transport named 'http' found. faultActor: null faultDetail: [10/5/10 13:19:40:937 EDT] 00000043 SystemOut O WSWS3166E: Error
 
jdbc compilation error - JDBC
jdbc compilation error  java.lang.Exception: Problem in call_select when i am executing the program i am getting the above error. how can i resolve it?  Hi friend, plz specify in detail and send me code
 
Compilation Error - Struts
Compilation Error  description The server encountered an internal error () that prevented it from fulfilling this request. exception org.apache.jasper.JasperException: Failed to load or instantiate TagExtraInfo class
 
Stateless Bean Error
Stateless Bean Error  Ejb stateless bean giving following error,please help me. 11:49:54,894 INFO [STDOUT] Error:$Proxy72 cannot be cast... are providing you a link that will illustrate you more clearly about Stateless Bean
 
Compilation error. Hibernate code - Hibernate
Compilation error. Hibernate code   Exception in thread "main" java.lang.NoClassDefFoundError: org/slf4j/LoggerFactory...) how to rectify that error in hibernate  Hi Friend, You have
 
srvlet compilation error - JSP-Servlet
srvlet compilation error  while compiling a servlet, httpservlet class not found errors & many such class not are generated.   Hi Friend, It seems that compiler haven't found the servlet-api.jar file.So put
 
Error in simple session bean ..................
Error in simple session bean ..................  Hi friends, i am trying a simple HelloWOrld EJb on Websphere Applicatiopn server 6.1. Can any one plz help me to solve this issue. here is the client code which i have
 
Stateless Session Bean Example Error
Stateless Session Bean Example Error  Dear sir, I'm getting following error while running StatelessSessionBean example on Jboss. Please help me... [STDOUT] Error:example not bound 22:57:12,683 INFO [STDOUT] add 22:57:12,687 ERROR
 
javservlet compilation error - Servlet Interview Questions
javservlet compilation error  hello sir I set the classpath in environment variables but I got the same error.what have to do can u plz help me.   if u had set classpath in environment variables then it doesnt
 
jsp code compilation error - JSP-Servlet
jsp code compilation error  hai, iam doing online banking project.i... is the error and also what is the proper code for funds transfer. HTTP... The server encountered an internal error () that prevented it from fulfilling
 
error
error  The content of element type "struts" must match "(package|include|bean|constant
 
spring3 mvc appliation bean definition not found error
the following error, can you suggest me how to solve. The error message is: Error creating bean with name...spring3 mvc appliation bean definition not found error  hi I
 
spring3 mvc appliation bean definition not found error
execute it shows index page, when I click on link it shows the following error Error creating bean with name...spring3 mvc appliation bean definition not found error  hi deepak I
 
program created and compilation error of connection rightly created n tested
program created and compilation error of connection rightly created n... error for connection on which other programs are running smoothly...:( import... ("there was some error in establishing connection : "+e); } sep
 
Input in Stateless Bean - EJB
Input in Stateless Bean  Hello, I am having problem in taking the input in stateless bean, when I am trying to get integer or double type input from the user in the client file, It shows me the error
 
Stateless Bean - EJB
Stateless Bean  Hi everybody, I m encountring a problem in stateless bean. I have taken a Integer type input in Client file, at the time of running the program it gives error java.lang.NumberFormatException : null. Please
 
Cmp Bean - EJB
Cmp Bean   I want to create connection pool in admin console in sun app server the data base is sql server, I gave the resource type... It will give the error, Operation 'pingConnectionPool' failed in 'resources' Config
 
user Registration form using bean
user Registration form using bean   In this code,password and confirm password does n't matches.Every time an error occured if i entered same string for both.Please help to sort my problem
 
Bean

 
I am getting error org.springframework.beans.factory.NoSuchBeanDefinitionException: No bean named 'IS_AUTHENTICATED_ANONYMOUSLY' is defined - Spring
I am getting error org.springframework.beans.factory.NoSuchBeanDefinitionException: No bean named 'IS_AUTHENTICATED_ANONYMOUSLY' is defined  Hello, I am getting error
 
From struts calling function to bean - EJB
"struts action class" to bean. I am using weblogic 8.1 web server.i am able... redeploy the .ear from weblogic ,i am getting error. java.rmi.NoSuchObjectException: Bean is already undeployed. i am not able to solve the problem. Waiting
 
compilation problem
compilation problem  struts 2.0 : i have included all 5 jars in lib folder,but its giving compilation problem that package open symphony doesnot exist ( though i imported it) & cant recognise SUCCESS etc symbol.i think i
 
compilation problem
compilation problem  struts 2.0 : i have included all 5 jars in lib folder,but its giving compilation problem that package open symphony doesnot exist ( though i imported it) & cant recognise SUCCESS etc symbol.i think i
 
compilation fail
compilation fail  package jsptube.tutorials.servletexample; import javax.servlet.GenericServlet; import javax.servlet.ServletRequest; import javax.servlet.ServletResponse; import java.io.IOException; import
 
Upload Code error on deploying
Upload Code error on deploying  on deploying the above code as it is said it is giving error that " No getter method for property thefile of bean org.apache.struts.taglib.html.BEAN " Error 500--Internal Server Error
 
compilation errors
compilation errors  package jsptube.tutorials.servletexample; import java.io.IOException; import java.io.PrintWriter; import javax.servlet.ServletConfig; import javax.servlet.ServletException; import
 
Binding Error in Spring - Spring
Binding Error in Spring  Error: Neither BindingResult nor plain target object for bean name 'loginBean' available as request attribute I am... What could be the cause of this error? Thanks
 
JSP Compilation

 
application cntext file error
application cntext file error  i got an error when execute the file in junit using application context file org.springframework.beans.factory.BeanCreationException: Error creating bean with name 'sessionFactory' defined in file
 
Error running webservice
Error running webservice  Hi, I am getting following error: 05/10 12:45:46 ERROR org.springframework.web.context.ContextLoader - Context initialization failed org.springframework.beans.factory.BeanCreationException: Error
 
Managed Bean
Managed Bean  What is Managed Bean
 
compilation errors - Swing AWT
compilation errors  how to create a window with five textFields, five labels and three buttons
 
Error in jdeveloper 10G
Error in jdeveloper 10G   500 Internal Server Error javax.servlet.jsp.JspException: Exception creating bean of class view.AddressForm: {1... org.apache.struts.action.ActionMapping; /* * Form bean for the Address Entry Screen. * */ public class
 
error
error  while iam compiling iam getting expected error
 
Error-
Error-   Hello, I would like to know about XSD file. I try to print XML file but I am getting error SAXException-- says Content is not allowed in prolog. Please help me
 
error
error  i have 404 error in my program plz tell me yhe solution about
 
error
error  i have 404 error in my program plz tell me yhe solution about
 
error
/ServletUserEnquiryForm.shtml getting an error given below SQLException caught: [Microsoft][ODBC SQL Server Driver]COUNT field incorrect or syntax error please suggest
 
Error
Error  I have created ajax with php for state and city. When I change state then city will not come in dropdown list and it give me error as 'Unknown Runtime Error'. This error come only in IE browser, but in other brower
 
error
error
 
error
error  When I deploye the example I have this message cannot Deploy HelloWorld Deployment Error for module: HelloWorld: Error occurred during deployment: Exception while deploying the app [HelloWorld
 
error!!!!!!!!!
error!!!!!!!!!   st=con.createStatement(); int a=Integer.parseInt(txttrno.getText()); String b=txttname.getText(); String c=txtfrom.getText(); String d=txtto.getText
 
error!!!!!!!!!
error!!!!!!!!!   st=con.createStatement(); int a=Integer.parseInt(txttrno.getText()); String b=txttname.getText(); String c=txtfrom.getText(); String d=txtto.getText
 
error!!!!!!!!!
error!!!!!!!!!   st=con.createStatement(); int a=Integer.parseInt(txttrno.getText()); String b=txttname.getText(); String c=txtfrom.getText(); String d=txtto.getText
 
entity bean
/ejb/entity-bean-example.shtml
 
Error
Error  Hi. I am getting error in the following code after the line I have commented as ERROR. How to solve this. Thanks in advance. package...;"); // ERROR out.println(" var pattern
 
Error
Error  Hi. I am getting error in the following code after the line I have commented as ERROR. How to solve this. Thanks in advance. package...;"); // ERROR out.println(" var pattern
 
Error
Error  Hi. I am getting error in the following code after the line I have commented as ERROR. How to solve this. Thanks in advance. package...;"); // ERROR out.println(" var pattern = /^\d{3,5
 
Site navigation
 

 

Send your comments, Suggestions or Queries regarding this site at roseindia_net@yahoo.com.

Copyright 2006. All rights reserved.