Programming Tutorials Browser Tutorials Articles Struts Tutorials Hibernate Tutorials

Search: 

  Tutorial: Eclipse-launch failed binaries not found

Eclipse-launch failed binaries not found


Tutorial Details:
Eclipse-launch failed binaries not found

Read Tutorial Eclipse-launch failed binaries not found.

Rate Tutorial:
Eclipse-launch failed binaries not found

View Tutorial:
Eclipse-launch failed binaries not found

Related Tutorials:

Displaying 1 - 50 of about 1938 Related Tutorials.

Eclipse-launch failed binaries not found
Eclipse-launch failed binaries not found  I recently downloaded eclipse(eclipse-cpp-europa-winter-win32) to work on c++. I don't know how to launch.... "LAUNCH FAILED NO BINARIES". Can anyone please explain me what's going on or problem
 
MySQL server PID file could not be found! [FAILED]
MySQL server PID file could not be found! [FAILED]  MySQL server PID file could not be found! [FAILED
 
problem with executing JSF file(Build failed)
problem with executing JSF file(Build failed)  *while executing below... application at context path /JSFProject3 but context failed to start /root... deployed. BUILD FAILED (total time: 9 seconds)*** Please any one give me solution
 
spring3 mvc appliation bean definition not found error
spring3 mvc appliation bean definition not found error  hi deepak I executed the spring3 registration validation example from rose india. when I... 'org.springframework.validation.beanvalidation.LocalValidatorFactoryBean#0': Invocation of init method failed; nested exception
 
spring3 mvc appliation bean definition not found error
spring3 mvc appliation bean definition not found error  hi I executed spring3 mvc with annotation example after clicking on the register page I got... 'org.springframework.validation.beanvalidation.LocalValidatorFactoryBean#0': Invocation of init method failed; nested exception
 
Path was not found
Path was not found  The Apache Tomcat Native library which allows optimal performance in production environments was not found on the java.library.path
 
identifier not found
identifier not found  Getting compilation error " identifier not found " please explain ?   identifier means variable name,,,,make sure it same as declaration
 
Failed Login

 
File not found
not found
 
File not found
not found
 
File not found
"(specified file not found
 
File not found
"(specified file not found
 
File not found
getting an error "emp_code.doc"(specified file not found)  Hi Friend
 
Steps not found.
Steps not found.  import java.io.*; import java.net.*; import javax.servlet.*; import javax.servlet.http.*; public class Details1 extends HttpServlet { protected void doGet(HttpServletRequest request, HttpServletResponse
 
File not found
not found)  Hi Friend, Visit Here Thanks
 
mycustomer.hbm.xml not found
: org.hibernate.MappingNotFoundException: resource: p1.mycustomer.hbm.xml not found
 
mycustomer.hbm.xml not found
: org.hibernate.MappingNotFoundException: resource: p1.mycustomer.hbm.xml not found
 
Lookup failed in SessionBean
Lookup failed in SessionBean  Hi. I've downloaded session bean example which invokes session beans. File was named example3. So I wanted to make this servlet in NetBeans so I copied .java files, index.jsp and web.xml into proper
 
Access URL Failed!?
Access URL Failed!?  Hi, May i know how to convert my domain name into IP address? becuase i working on J2ME but don't know why the my application unable to access the URL. "connector.open("http://886089.com/datetime.asp")". I
 
Failed Client-Socket Communication
Failed Client-Socket Communication  I hve written a server program & a client program. The server is supposed to echo watever is typed in the client. I hve to get 16 values to be echoed. I hve created a string and all
 
maven build failed

 
maven build failed

 
Apache Tomcat Login Failed

 
Apache Tomcat Login Failed

 
class not found exception
class not found exception  org.apache.struts2.dispatcher.ng.filter.StrutsPrepareAndExecuteFilterprint("code sample
 
java.lang.RuntimeException: Failed to register user. - MobileApplications
java.lang.RuntimeException: Failed to register user.  Hi Mr.Deepak i... this java.lang.RuntimeException: Failed to register user...] com.mas.distribution.RegisterUserServlet::doGet 83: Failed to create the user
 
FAILED TO INSERT DATA FROM FUNCTION();
FAILED TO INSERT DATA FROM FUNCTION();  HELLO, I HAVE A PROBLEM TO INSERT DATA FROM OUTPUT FROM FUNCTION()... I WANT TO STORE THE OUTPUT IN DATABASE, BUT FAILED TO INSERT... before this.... ......................... function
 
javascript image not found
javascript image not found  javascript if image not found   <a href='$image'> <img alt='No Image' src='$image' onError="this.parentNode.onclick=function() {return(false);}"> </a>
 
javax.servlet not found error
javax.servlet not found error  why iam getting javax.servlet error while running my servlet program...after setting the classpath also i am finding that problem
 
no def found - JSP-Servlet
no def found  i have used the code of file upload from rose india but when i run no def found for fileupload exception although i have put jar file in lib folder code i get from D:\project\Uploading Employee Profile
 
CLASS NOT FOUND EXCEPTION
CLASS NOT FOUND EXCEPTION   I AM USING INTERNET EXPLORER VERSION 6.00 AND I WANT TO UPLOAD MY INCOME TAX RETURN ONLINE BY DIGITAL SIGN BUT WHEN I... NOT FOUND EXCEPTION AND THE BOX IS DISPLAYED AND I CLICK ON DETAILS BUTTON
 
class not found error - JDBC
class not found error  thanks for your response. please clarify the following doubts. i am having the specified mysql connector jar file. where.... if so which version and share the link or download location. whether eclipse
 
SQLException caught: No data found
SQLException caught: No data found  i m using ms office 2010, n when i run my source code it is giving error SQLException caught:No data found, plz help me why i am getting this exception, thanks alot, my source code
 
LOGIN FAILED", $_SESSION['login fail']='0',}?>
LOGIN FAILED", $_SESSION['login fail']='0',}?>  please correct my error guys
 
Error:No Class Found Exception:org.postgresql.driver
Error:No Class Found Exception:org.postgresql.driver  Error:No Class Found Exception:org.postgresql.driver while connecting JDBC With PostgreSQL 8.4 I m running My Program with java 6.0
 
Backup Failed Mysqldump Got Errno 28 On Write
Backup Failed Mysqldump Got Errno 28 On Write  Hi, While taking the backup of database I got following error: Backup Failed Mysqldump Got Errno 28 On Write How to resolve the issue? Thanks   Hi, This error comes
 
unable to import class com.opensymphony.xwork2.ActionContext not found
unable to import class com.opensymphony.xwork2.ActionContext not found  Imported class com.opensymphony.xwork2.ActionContext not found gettin the above error
 
Eclipse juno failed to load the jni shared library
Eclipse juno failed to load the jni shared library  Hi, I have downloaded the 64 BIT version of Eclipse juno "eclipse-jee-juno-SR2-win32-x86_64.zip... the error "Eclipse juno failed to load the jni shared library". Let's know what
 
http 404 resource not found error
http 404 resource not found error   Sir, I have downloaded your RichLRApplication and deployed on tomcat 6 with oracle backend. Application started... not found error. Kindly advise. ss
 
Java file not found exception
Java file not found exception This section illustrates you the concept of file not found exception. Java provides a powerful concept of Exceptions... by a code. When a file with the specified pathname does not exist, file not found
 
SQLException:Column not found? (help me:(
SQLException:Column not found? (help me:(  import javax.swing.*; import java.sql.*; import java.awt.*; import java.awt.event.*; public class Mini2 extends JFrame implements ActionListener { String userid="data",password="1234
 
javac complier not found - JSP-Servlet

 
Getting ..Photograph.jpg not found - Swing AWT

 
exception handling code for file not found error..
exception handling code for file not found error..  How to do exception handling for file not found error
 
Failed to run Online Quiz Application in JSP - JSP-Interview Questions
Failed to run Online Quiz Application in JSP   Hi, I have been following your following link to run the online quiz application, but I failed to get the result screen and correct answer and score displayed in the web. Could
 
How to code in struts for 3 Failed Login attempts - Struts
How to code in struts for 3 Failed Login attempts  Hi, I require help. I am doing one application in struts where i have to incorporate the functionality like while log in if the user enters a wrong password for 3 times
 
No suitable driver found for jdbc:mysql://localhost:3306/TEST
No suitable driver found for jdbc:mysql://localhost:3306/TEST  hii, I have wrietten web project using jsp and hibernate but its not working. ava.sql.SQLException: No suitable driver found for jdbc:mysql://localhost:3306/TEST
 
Failed to execute goal org.apache.maven.plugins:maven-archetype-plugin:2.2:generate
Failed to execute goal org.apache.maven.plugins:maven-archetype-plugin:2.2... giving following error: [ERROR] Failed to execute goal org.apache.maven.plugins...:generate failed: Plugin org.apache.maven.plugins:maven-archetype-plugin:2.2 or one
 
SEVERE: Context [/hospital] startup failed due to previous errors
SEVERE: Context [/hospital] startup failed due to previous errors  Hi... org.apache.catalina.core.StandardContext start SEVERE: Context [/hospital] startup failed due to previous errors Jan... nam Thread-3] but has failed to stop it. This is very likely to create a memory
 
JSP error: class UserForm not found in class model.UserAction
JSP error: class UserForm not found in class model.UserAction  etting the following error in the program..wat shod i do to remove this?I am using jdeveloper 10 g [code] package model; import javax.servlet.http.HttpServletRequest
 
Site navigation
 

 

Send your comments, Suggestions or Queries regarding this site at roseindia_net@yahoo.com.

Copyright 2006. All rights reserved.