Programming Tutorials Browser Tutorials Articles Struts Tutorials Hibernate Tutorials

Search: 

  Tutorial: i got an error while compile this program manually.

i got an error while compile this program manually.


Tutorial Details:
i got an error while compile this program manually.

Read Tutorial i got an error while compile this program manually..

Rate Tutorial:
i got an error while compile this program manually.

View Tutorial:
i got an error while compile this program manually.

Related Tutorials:

Displaying 1 - 50 of about 28380 Related Tutorials.

i got an error while compile this program manually.
i got an error while compile this program manually.  import... mapping.findForward("errors.jsp"); } } i set both servlet,struts jar files and i got an error in saveErrors() error Heading cannot find
 
compile error
program with Test.java and try to compile with javac test.java an error like..."); } } i have save this program with A.java. Then I executed this program javac A.java...compile error  Hello All for example public class
 
i have got error while compiling simple tag handler
i have got error while compiling simple tag handler   javac.servlet.jsp not found! tell me what are the jar files required to run simple tag handler...;it is : javax.servlet.jsp only but getting error wt is reason
 
i got an exception while accept to a jsp
i got an exception while accept to a jsp  type Exception report message description The server encountered an internal error... in a file.later i changed it to ANSII problem is resolved
 
Compile error - Java Beginners
Compile error  I get this error when compiling my program: java:167... to be thrown tc.countLines(inFile); ^ 1 error... standards this will work since i put the bracket on the same line
 
Compile time error
Compile time error  Hi, When i compile my simple program in cmd am getting a error like "Javac is not a recognized as an internal or external command, operable program or batch file" How to resolve this problem ????  
 
compile time error
compile time error  my program compile successfully and make the class file also but when i tried to do next command to see the output,it showing error that "could not find or load main class fibbo" fibbo is my class name
 
compile time error
compile time error  my program compile successfully and make the class file also but when i tried to do next command to see the output,it showing error that "could not find or load main class fibbo" fibbo is my class name
 
compile time error
compile time error  my program compile successfully and make the class file also but when i tried to do next command to see the output,it showing error that "could not find or load main class fibbo" fibbo is my class name
 
I GOT ERROR FOR MY PROJECT
I GOT ERROR FOR MY PROJECT  Dear Friend/ RoseIndia Team, Firstly I would to thank u Guys help me so many time.. I got error on my little project when running at server. please correctly my error Guys... ERROR CODE: "LOGIN
 
error while running the applet - Java Beginners
); ++num; } } } } i have problem while running the code , error...error while running the applet  import java.applet.Applet; import... classes in the MyFrame class , can you expalin?  Hi Your program
 
i cant find any compile time error but there is runtime error.
i cant find any compile time error but there is runtime error.  ...: "); while (res.next()) { String i = res.getString("stud_code..."); System.out.println("studentcode: " + "\t" + "studentname: "); while
 
when I run exiting project that time I got error, I want solution on it?
when I run exiting project that time I got error, I want solution on it?  Error occurred during deployment: Exception while loading the app : java.lang.IllegalStateException: ContainerBase.addChild: start
 
I got build failed when deploying enterprise application - EJB
I got build failed when deploying enterprise application  I created web application with ejb moduless and stateless session beans. However, i am...: deps-j2ee-archive: init: deps-module-jar: deps-ear-jar: init: deps-jar: compile
 
while executing a java program
while executing a java program  while iam executing a simple java program after i type "java simple.java" there was a an error occuring.the error is "exception in thread "main" java.lang.noclassdeffounderror:simple" what thus
 
Backup Failed Mysqldump Got Errno 28 On Write
Backup Failed Mysqldump Got Errno 28 On Write  Hi, While taking the backup of database I got following error: Backup Failed Mysqldump Got Errno 28 On Write How to resolve the issue? Thanks   Hi, This error comes
 
compile this program and let me know the resolution
compile this program and let me know the resolution  class Maxof2...+" is greater than "+i); } } please compile and let me know the resolution  ... argument. //Converting String format to Integer value int i = Integer.parseInt
 
hi, Everyone ,i'm learning jdbc, i got an nullpointerexception when execute this program.
hi, Everyone ,i'm learning jdbc, i got an nullpointerexception when execute this program.   ConnectionProvider.java import java.util.*; import..."); while(rset.next()) { System.out.println(rset.getInt(1)+"\t
 
compile and run java program
compile and run java program  Hello, everyone!!! I just want to ask if you anyone here knows how to compile java file in linux specifically UBUNTU... do I compile and run this file using the terminal of ubuntu... By the way, I am
 
I/O Program output error
I/O Program output error  Hello All, I am working on a program... file, but I am getting incorrect output. I have been successfull with part of the program in that it reads the text file and analyzes it, however I need it to take
 
cannot find java.exe error while opening netbean5.5 - IDE Questions
this problem? 2)while i am installing nokiamobiletoolkit, I got the error name is windows 3 occured while loading the java vm(launching error anywhere), How can i...cannot find java.exe error while opening netbean5.5  HI, 1)i am
 
error while compiling - Java Beginners
error while compiling  i am facing problem with compiling and running a simple java program, can any one help me, the error i am getting is javac is not recognised as internal or external command  Check if you JAVA_HOME
 
Error While Compiling - Java Beginners
Error While Compiling  Hi All I Am a beginner and i face the following problem while compiling can anyone help me. C:\javatutorial\example>... command, operable program or batch file. C:\javatutorial\example>  
 
Java compile error - Java Beginners
Java compile error  I am having trouble compiling the Java project available on this site at http://www.roseindia.net/chatserver/index.shtml... to compile Java on Mac besides using the Terminal
 
How to compile & get output for JSP
the answer as RUN the JSP How to run the JSP Program? But what i mean is that i created a small jsp program in HTML and saved as Hello.jsp. And next i opened the Browser and got the necessary path and i clicked on it but it gave me
 
how to compile and run servlet program
how to compile and run servlet program   hello sir/mam i hve installed tomcat5.5 version and also have jdk1.6.0_14 installed but not able to run it or compile i m doing it first tyme pls help me in sorting out this problem. i hve
 
i got illegal start of expression error , plese tell me the mistake where i did...
i got illegal start of expression error , plese tell me the mistake where i did...   import org.springframework.context.*; import java.util.*; public class MyListener implements ApplicationListener { public static void main
 
Data Provider or other service returned an E_FAIL status Error
and got the error "Data Provider or other service returned an E_FAIL status Error" while moving the Record Set forward. On trying for the solution I found... NOT NULL DEFAULT 'now()'; After doing so program started working and error
 
Java compile time error. - Java Beginners
Java compile time error.  CreateProcess error=2, The system cannot find the file specified  Pleae Describe your query  Hi friend... technologies then i am sending you a link. This link will help you. Please visit
 
How to compile and run the JSP
How to compile and run the JSP  Hi Kindly tell me how to run and compile JSP small Program using Tomcat as webserver. I created small program HELLO JSP in HTML and compile the program but it is saying Class o r interface
 
Error with Maven while deploying the war file
Error with Maven while deploying the war file  Hi, I am new to maven... I created java spring hibernate project.. and i kept all .java files.... then I got the index page of my application.. then after clicking any link
 
Error with Maven while deploying the war file
Error with Maven while deploying the war file  Hi, I am new...; </build> </project> But after deploying that i got this error... in localhost 8080. then I got the index page of my application.. then after clicking
 
error got minus one from read call - JSP-Servlet
error got minus one from read call  hiiii while connecting my servlet to database im getting error called java.sql.SQLException: Io exception: Got... "); // displaying records while(rs.next()){ out.print(rs.getObject(1
 
ERRor in executing DB program
ERRor in executing DB program  While executing following code an Error was generated.can any one help me for this. LiveDB liveDBObj... = liveDBObj.getPreparedStatement(qry); pstmt.setDouble(1,2.0); pstmt.setString(2,"name1"); int i
 
Unable to compile Servlet
was created by me. To compile my servlet program I did the following: C:\apache...Unable to compile Servlet  First I installed the tomcat server in C... JAVA_HOME with the value C:\Program Files\Java\jdk1.6.0.14 Then I created
 
Not able to call Web Service from Eclipse
Error was java.lang.ClassNotFoundException: org.apache.axis2.transport.http.AxisAdminServlet. Error was: Nov 18, 2009 10:46:49 PM...; To solve the problem I added httpcore-4.0.jar into web application. This solved
 
why the program is showing error?
why the program is showing error?  <%@page import="java.sql.*"%>..."); Integer i=0; out.println("hi"); while(rs1.next...=Integer.parseInt(rs1.getString(10)); 36: i=i+k; An error occurred at line
 
i have installed oracle 10g (both ee and xe) editions... while am installing i found port num as 1521 for ee, 1522 for xe
run this prog.... i got error like driver is registered...i have installed oracle 10g (both ee and xe) editions... while am installing i... 10g (both ee and xe) editions... while am installing i found port num as 1521
 
servlet not compile - Java Beginners
servlet not compile  Hi friend, I am Using JDK 5.0 with that javax.servlet is not available so i download this package and put it in the src folder,but my program displayed "package not found" at the time of compilation
 
exception in thread main while running servlet
exception in thread main while running servlet  I got exception in thread main no such method error while running servlet. I have added servlet.api.jar file in classpath.my classpath is C:\Program Files\Apache Software Foundation
 
Compile error - WebSevices
Compile error  Hello, How to read .pdf file using Javascript/php. Any one send the code
 
Example to compile a java file with the help of the program
Example to compile a java file with the help of the program... are describing you the way to compile the java file with the help of the java program. The steps involved for compiling the java file from the program are described
 
I had this error while deploying a web services in jboss
I had this error while deploying a web services in jboss  Error configuring application listener of class com.sun.xml.ws.transport.http.servlet.WSServletContextListener: java.lang.ClassNotFoundException
 
Unable to compile class for JSP - WebSevices
Unable to compile class for JSP  org.apache.jasper.JasperException: Unable to compile class for JSP When I am trying to access a java file kept under src folder under a package from a jsp page placed under web directory, I am
 
plaz help me i try to compile from last 2 day .
plaz help me i try to compile from last 2 day .   org.apache.jasper.JasperException: Unable to compile class for JSP: An error occurred at line...: psUpdateRecord.setString(4,Mobileno); An error occurred at line: 37 in the jsp file
 
plaz help me i try to compile from last 2 day .
plaz help me i try to compile from last 2 day .   org.apache.jasper.JasperException: Unable to compile class for JSP: An error occurred at line...: psUpdateRecord.setString(4,Mobileno); An error occurred at line: 37 in the jsp file
 
compilation error
compilation error  Hi my program below is not compiling,when I try to compile it i'm getting the error message "tool completed with exit code 1".The loop has to be at the end of the program can you help me. Blockquoteimport
 
error
error  i have 404 error in my program plz tell me yhe solution about
 
error
error  i have 404 error in my program plz tell me yhe solution about
 
Simple java program
Simple java program Hi this is the thing we got to do and i am totally confused on how to write this program it would be a great help i could be helped. For the part 1 i got it but the second part how do you start writing
 
Site navigation
 

 

Send your comments, Suggestions or Queries regarding this site at roseindia_net@yahoo.com.

Copyright 2006. All rights reserved.