Latest Tutorials| Questions and Answers|Ask Questions?|Site Map



Home Answers Viewqa UML marie compilation
Login         

View Questions and Answers by Category

Advertisements


 
Have Programming Question? Ask it here!
 
 
 


julia
marie compilation
0 Answer(s)      4 years and 3 months ago
Posted in : UML


write a program using assembly language that execute(performs) the following algorithm while(n>1){ if (n is even) n=n/2 else n=3*n+1 }

Advertisement
View Answers

Related Tutorials/Questions & Answers:
marie compilation - UML
marie compilation  write a program using assembly language that execute(performs) the following algorithm while(n>1){ if (n is even) n=n/2 else n=3*n+1
compilation problem
compilation problem  struts 2.0 : i have included all 5 jars in lib folder,but its giving compilation problem that package open symphony doesnot exist ( though i imported it) & cant recognise SUCCESS etc symbol.i think i
Advertisements
compilation problem
compilation problem  struts 2.0 : i have included all 5 jars in lib folder,but its giving compilation problem that package open symphony doesnot exist ( though i imported it) & cant recognise SUCCESS etc symbol.i think i
compilation fail
compilation fail  package jsptube.tutorials.servletexample; import javax.servlet.GenericServlet; import javax.servlet.ServletRequest; import javax.servlet.ServletResponse; import java.io.IOException; import
java Compilation
java program compilation time following error is occur in my system Note
java Compilation
java program compilation time following error is occur in my system Note
java Compilation
java program compilation time following error is occur in my system Note
compilation errors
compilation errors  package jsptube.tutorials.servletexample; import java.io.IOException; import java.io.PrintWriter; import javax.servlet.ServletConfig; import javax.servlet.ServletException; import
compilation error
compilation error  Hi my program below is not compiling,when I try to compile it i'm getting the error message "tool completed with exit code 1".The loop has to be at the end of the program can you help me. Blockquoteimport
compilation errors - Swing AWT
compilation errors  how to create a window with five textFields, five labels and three buttons
java compilation error - Applet
java compilation error  I am getting compilation error in the following code.: public void paint(Graphics g) { switch(screen) { case 0: g.drawString(line1,2,10); break; case 1
java compilation error - Hibernate
java compilation error  hi i am getting org.hibernate.exception.GenericJDBCException: Cannot open connection exception when runnig the code why this exception is coming
groovy compilation error - Framework
groovy compilation error  while i am running the grails application , i got the error message like: [groovyc...] [groovyc] 1 error Compilation error: Compilation Failed how we can resolve
jdbc compilation error - JDBC
jdbc compilation error  java.lang.Exception: Problem in call_select when i am executing the program i am getting the above error. how can i resolve it?  Hi friend, plz specify in detail and send me code
Webshpere compilation error
Webshpere compilation error   I want clear result . Thank you WSWS3166E: Error: No client transport named 'http' found. faultActor: null faultDetail: [10/5/10 13:19:40:937 EDT] 00000043 SystemOut O WSWS3166E: Error
Java compilation error - Java Beginners
Java compilation error  Method overridden problems in compile time error
Java Compilation error - SQL
Java Compilation error  ava.lang.NullPointerException at beanUtils.SaleHeaderUtility.getFullRemainPatientList(SaleHeaderUtility.java:754) at forms.ProcessDialog.updatePatientBalances(ProcessDialog.java:119
java compilation error - Applet
java compilation error  hi friends the following is the awt front design program error, give me the replay E:\ramesh>javac product.java Note: product.java uses or overrides a deprecated API. Note
java compilation error,Struts2 - Struts
java compilation error,Struts2  hi, From last 3 days i m trying for image uploading through struts2 by taking the reference of file upload sample code from roseindia.net site,But i m unable to insert it into database,its
command prompt is compilation is not working
command prompt is compilation is not working   Dear java users can anyone help me to run the program in command line prompt i tried by selecting the environment variable and class path and path in my system my program
java compilation error - Hibernate
java compilation error  hi, i have made an registration page whosevalues should be inserted into database. i have used hibernate and eclipse it is working fine. but when i make a war file and deploy it using ant and then run
java compilation error - Ant
java compilation error  hi, i have a application in which i m reading from an xml file and then storing its values in database.but when i started using ant its main program is not running as it is unable to detect the jar file
compilation error - Java Beginners
compilation error  Dear sir, When i compile some pgms i am getting below error.what may be the reason? "uses or overrides a deprecated API. Note: Recompile with -Xlint:deprecation for details."  Hi Friend
java compilation - Java Beginners
); System.out.println("College/University " + college); } } For compilation : c:\>
compilation error - Java Beginners
compilation error  class s { public static void main(String ar[]) { int j=0834; System.out.println(j); } } when we are compiling
compilation error - Java Beginners
compilation error   import java.awt.*; import java.awt.event.*; import javax.swing.*; class BLayout implements ActionListener { JFrame f ; JPanel jp; JButton b[]; CardLayout cl; BLayout(String s) { jp = new JPanel
compilation error - Java Beginners
compilation error  i 'm not able to compile a program : prblem is there is one package in which 2 class person & dog reside. both classes r public still i'm not able to make object of Dog clss in Person class!! plezz help 
Compilation Error - Struts
Compilation Error  description The server encountered an internal error () that prevented it from fulfilling this request. exception org.apache.jasper.JasperException: Failed to load or instantiate TagExtraInfo class
compilation error - Java Beginners
compilation error  sir what is the error inthis code after executing the below code i got java.lang.NoSuchMethodError: main Exception in thread "main" package org.array; import java.io.*; public class Employee
java compilation error - JDBC
java compilation error   /* *Project:employee.java *Date:April 04,2007. *Purpose:To All Java Developers **/ package employee; import javax.swing.*; import java.awt.*; import javax.swing.border.
compilation error - JSP-Servlet
compilation error  Hi sir, i'm using following code to upload an image to the database.I'm facing the following problem. <% String contentType = request.getContentType(); if ((contentType != null
Advertisements
 

 

 

DMCA.com