when I run exiting project that time I got error, I want solution on it?
0 Answer(s)      3 years and 5 months ago
Posted in : Java Beginners
Error occurred during deployment: Exception while loading the app : java.lang.IllegalStateException: ContainerBase.addChild: start: org.apache.catalina.LifecycleException: java.lang.RuntimeException: java.lang.NoClassDefFoundError: org/apache/commons/lang3/StringUtils. Please see server.log for more details.

PER01003: Deployment encountered SQL Exceptions: . ? . E:\IBPro\omins1\OmnisTools\nbproject\build-impl.xml:757: The module has not been deployed. See the server log for details.

BUILD FAILED (total time: 1 minute 20 seconds)

View Answers

Related Tutorials/Questions & Answers: